5.2 Beta (Mac)

Issues and Comments on the Current Beta Versions
Tim
Site Admin
Posts: 1025
Joined: Sun Dec 07, 2008 1:14 pm

Re: 5.2 Beta (Mac)

Postby Tim » Thu Jun 01, 2017 6:50 am

Thanks for the reminder. I will add the reference linking code to the Mac edition that is on the Windows. I forgot to do it.
Tim Morton
Developer, Bible Analyzer

But to him that worketh not, but believeth on him that justifieth the ungodly, his faith is counted for righteousness. (Rom 4:5 AV)

Tim
Site Admin
Posts: 1025
Joined: Sun Dec 07, 2008 1:14 pm

Re: 5.2 Beta (Mac)

Postby Tim » Sun Jun 18, 2017 12:53 pm

I posted a new beta. It is the same link as in the initial post.

This one fixes some issues with the captions being out of sync.
The show Strong's numbers option not being saved
The maximize state not being saved
and a couple other things.
Tim Morton
Developer, Bible Analyzer

But to him that worketh not, but believeth on him that justifieth the ungodly, his faith is counted for righteousness. (Rom 4:5 AV)

doughead
Posts: 20
Joined: Tue Mar 24, 2015 5:44 pm

Re: 5.2 Beta (Mac)

Postby doughead » Sat Jun 24, 2017 9:00 am

I'm running Mac OS X version 10.12.5, and I just downloaded the 5.2 Beta. So far, most everything seems to work OK, but I have noticed one glitch. This may have already been brought to your attention, but I couldn't find anything on the forums. The issue has to do with the verse pop-up that occurs whenever you mouse over a scripture reference. In the release version of Bible Analyzer (5.0), whenever I held down the COMMAND key (Apple key) as I moused over a scripture reference, the popup displayed three verses before and three verses after the referenced verse, since I had "7" selected in the Preferences dialog (Options II tab) for "Maximum Popup Verse Range." In the 5.2 beta version, I can't seem to duplicate this behavior. I'm not sure if the COMMAND key has changed to some other key, or if this feature is suddenly missing. I've tried the COMMAND, OPTION, CONTROL and SHIFT keys, and various combinations of the above, but all I get as I mouse over a scripture reference is a popup showing the single verse referenced.

Tim
Site Admin
Posts: 1025
Joined: Sun Dec 07, 2008 1:14 pm

Re: 5.2 Beta (Mac)

Postby Tim » Sat Jun 24, 2017 9:09 pm

I'll look into this. Probably some code I commented out to test something else.
Tim Morton
Developer, Bible Analyzer

But to him that worketh not, but believeth on him that justifieth the ungodly, his faith is counted for righteousness. (Rom 4:5 AV)

HansK
Posts: 30
Joined: Tue Feb 07, 2012 2:40 am

Re: 5.2 Beta (Mac)

Postby HansK » Tue Jul 11, 2017 2:04 pm

Tim,
Perhaps you post the latest build.
Mine does not work correctly. My Commentary screens stays on screen after exiting. I have to force stop the program.

Hans

Tim
Site Admin
Posts: 1025
Joined: Sun Dec 07, 2008 1:14 pm

Re: 5.2 Beta (Mac)

Postby Tim » Mon Jul 17, 2017 10:13 am

New beta is now available (5.2.0.21),
http://www.bibleanalyzer.com/files/Bibl ... 52beta.dmg

Fixes,

You can now quit by,
closing BA from the toolbar button,
Clicking the "Quit Analyzer5" item in the menu,
or by Cmd+Q

Hank, hopefully this will also resolve your hanging commentary issue when closing.

Also, there is a new Preferences item in the Main Apple Menu.

Also, the quick search entry freezing issue (mentioned in another thread) is resolved, I think.

And, as mentioned by Doug, the Cmd key will again cause the verse popups to show a range of verses. Also, holding Cmd while hovering over a word in the Bible panel will display the topic from the current dictionary in a popup.
Tim Morton
Developer, Bible Analyzer

But to him that worketh not, but believeth on him that justifieth the ungodly, his faith is counted for righteousness. (Rom 4:5 AV)

HansK
Posts: 30
Joined: Tue Feb 07, 2012 2:40 am

Re: 5.2 Beta (Mac)

Postby HansK » Tue Jul 18, 2017 7:41 pm

Tim,

Thanks bro for the updated build. It works fine now.
Also many thanks for Alford updated!

Keep you in my prayers for the wonderful work you do.

Hans
The Netherlands

srice
Posts: 90
Joined: Thu Aug 12, 2010 8:53 am
Location: USA
Contact:

Re: 5.2 Beta (Mac)

Postby srice » Sat Jul 22, 2017 8:56 am

Tim,

I'm on 10.11.6 and it will not load for me either.
EDIT:
This was on the first Beta link, not the second.... I overlooked the second beta link.

Code: Select all

7/22/17 3:54:31.969 PM lsd[330]: LaunchServices: Could not store lsd-identifiers file at /private/var/db/lsd/com.apple.lsdschemes.plist
7/22/17 3:54:34.117 PM lsd[330]: LaunchServices: Could not store lsd-identifiers file at /private/var/db/lsd/com.apple.lsdschemes.plist
7/22/17 3:54:34.431 PM Bible Analyzer[9910]: Bible Analyzer Error
7/22/17 3:54:34.443 PM launchservicesd[87]: SecTaskLoadEntitlements failed error=22
7/22/17 3:54:34.449 PM launchservicesd[87]: SecTaskLoadEntitlements failed error=22
7/22/17 3:54:34.530 PM appleeventsd[58]: SecTaskLoadEntitlements failed error=22
7/22/17 3:54:38.384 PM WindowServer[200]: send_datagram_available_ping: pid 493 failed to act on a ping it dequeued before timing out.
7/22/17 3:54:38.404 PM launchservicesd[87]: SecTaskLoadEntitlements failed error=22
7/22/17 3:54:38.507 PM launchservicesd[87]: SecTaskLoadEntitlements failed error=22
7/22/17 3:54:39.388 PM secd[377]:  securityd_xpc_dictionary_handler cloudd[393] copy_matching Error Domain=NSOSStatusErrorDomain Code=-50 "query missing class name" (paramErr: error in user parameter list) UserInfo={NSDescription=query missing class name}
7/22/17 3:54:39.388 PM cloudd[393]:  SecOSStatusWith error:[-50] Error Domain=NSOSStatusErrorDomain Code=-50 "query missing class name" (paramErr: error in user parameter list) UserInfo={NSDescription=query missing class name}
7/22/17 3:54:41.261 PM bird[369]: UNREACHABLE: Asking for asset index out of bounds 0 vs 0
7/22/17 3:54:49.730 PM secd[377]:  securityd_xpc_dictionary_handler cloudd[393] copy_matching Error Domain=NSOSStatusErrorDomain Code=-50 "query missing class name" (paramErr: error in user parameter list) UserInfo={NSDescription=query missing class name}
7/22/17 3:54:49.730 PM cloudd[393]:  SecOSStatusWith error:[-50] Error Domain=NSOSStatusErrorDomain Code=-50 "query missing class name" (paramErr: error in user parameter list) UserInfo={NSDescription=query missing class name}


That is what fills the console when I attempt to run it.
EDIT:
I just realized there was a new Beta image... I'm downloading that now to give that test.
Serving the King,
Shane Rice
Romans 12:1-2
http://www.ricefamilyministries.com

srice
Posts: 90
Joined: Thu Aug 12, 2010 8:53 am
Location: USA
Contact:

Re: 5.2 Beta (Mac)

Postby srice » Sat Jul 22, 2017 9:04 am

Ok, here are the console results for the second Beta link... still not working for me:

Code: Select all

7/22/17 4:02:36.807 PM lsd[330]: LaunchServices: Could not store lsd-identifiers file at /private/var/db/lsd/com.apple.lsdschemes.plist
7/22/17 4:02:36.832 PM CoreServicesUIAgent[9724]: Error -60005 creating authorization
7/22/17 4:02:40.994 PM WindowServer[200]: send_datagram_available_ping: pid 493 failed to act on a ping it dequeued before timing out.
7/22/17 4:02:43.436 PM lsd[330]: LaunchServices: Could not store lsd-identifiers file at /private/var/db/lsd/com.apple.lsdschemes.plist
7/22/17 4:02:43.739 PM Bible Analyzer[9970]: Bible Analyzer Error
7/22/17 4:02:43.751 PM launchservicesd[87]: SecTaskLoadEntitlements failed error=22
7/22/17 4:02:43.766 PM lsd[330]: LaunchServices: Could not store lsd-identifiers file at /private/var/db/lsd/com.apple.lsdschemes.plist
7/22/17 4:02:43.768 PM launchservicesd[87]: SecTaskLoadEntitlements failed error=22
7/22/17 4:02:43.853 PM appleeventsd[58]: SecTaskLoadEntitlements failed error=22
7/22/17 4:02:44.150 PM SpotlightNetHelper[386]: tcp_connection_tls_session_error_callback_imp 70 __tcp_connection_tls_session_callback_write_block_invoke.434 error 22



I'm on Mac 10.11.6
and Beta 5.2.0.21
Serving the King,
Shane Rice
Romans 12:1-2
http://www.ricefamilyministries.com

Tim
Site Admin
Posts: 1025
Joined: Sun Dec 07, 2008 1:14 pm

Re: 5.2 Beta (Mac)

Postby Tim » Mon Jul 24, 2017 4:19 pm

Shane,

Try moving your
USER/Library/Application Support/Bible Analyzer
folder and then try to start Bible Analyzer. It will generate a new folder.

If it starts, you can move the modules folder and any user made files (markup, etc) back to the original location.

If it still won't start. let me know.
Tim Morton
Developer, Bible Analyzer

But to him that worketh not, but believeth on him that justifieth the ungodly, his faith is counted for righteousness. (Rom 4:5 AV)


Return to “5.2 Beta Testing”

Who is online

Users browsing this forum: No registered users and 2 guests

cron